Home » Stella » Report a problem or request a feature » nux build library libXext (skipping incompatible /usr/lib64/
nux build library libXext [message #3057] Wed, 11 March 2015 02:31 Go to next message
stuartw is currently offline  stuartw
Messages: 1
Registered: March 2015
Junior Member
Both 32 and 64 bit versions of libXext are installed (according to yum) but a build using simple-build-and-install fails stating the libXext is incompatible and is skipped. Any ideas what is wrong?

dmake[2]: Entering directory `/home/stuart/Downloads/ssr-master/build32/glinject'
/bin/sh ../libtool --tag=CXX --mode=link g++ -m32 -pthread -fPIC -std=c++0x -Wall -O2 -pipe -pthread -fPIC -avoid-version -shared -lrt -ldl -lGL -lGLU -lX11 -lXfixes -o -rpath /usr/lib libssr_glinject_la-elfhacks.lo libssr_glinject_la-GLInject.lo libssr_glinject_la-GLXFrameGrabber.lo libssr_glinject_la-Hook.lo libssr_glinject_la-SSRVideoStreamWriter.lo
libtool: warning: library '/usr/lib/gcc/x86_64-redhat-linux/4.8.2/../../../../lib/libG' was moved.
libtool: link: g++ -m32 -fPIC -DPIC -shared -nostdlib /usr/lib/gcc/x86_64-redhat-linux/4.8.2/../../../../lib/crti. o /usr/lib/gcc/x86_64-redhat-linux/4.8.2/32/crtbeginS.o .libs/libssr_glinject_la-elfhacks.o .libs/libssr_glinject_la-GLInject.o .libs/libssr_glinject_la-GLXFrameGrabber.o .libs/libssr_glinject_la-Hook.o .libs/libssr_glinject_la-SSRVideoStreamWriter.o -Wl,-rpath -Wl,/usr/lib/gcc/x86_64-redhat-linux/4.8.2/../../../../lib -Wl,-rpath -Wl,/usr/lib/gcc/x86_64-redhat-linux/4.8.2/../../../../lib -lrt /usr/lib/gcc/x86_64-redhat-linux/4.8.2/../../../../lib/libGL .so -L/usr/X11R6/lib -lXext -ldl -lGLU -lX11 -lXfixes -L/usr/lib/gcc/x86_64-redhat-linux/4.8.2/32 -L/usr/lib/gcc/x86_64-redhat-linux/4.8.2/../../../../lib -L/lib/../lib -L/usr/lib/../lib -L/usr/lib/gcc/x86_64-redhat-linux/4.8.2 -L/usr/lib/gcc/x86_64-redhat-linux/4.8.2/../../.. -lstdc++ -lm -lc -lgcc_s /usr/lib/gcc/x86_64-redhat-linux/4.8.2/32/crtendS.o /usr/lib/gcc/x86_64-redhat-linux/4.8.2/../../../../lib/crtn. o -m32 -pthread -O2 -pthread -pthread -Wl,-soname -Wl, -o .libs/
/usr/bin/ld: skipping incompatible /usr/lib64/ when searching for -lXext
/usr/bin/ld: cannot find -lXext
collect2: error: ld returned 1 exit status
make[2]: *** [] Error 1
make[2]: Leaving directory `/home/stuart/Downloads/ssr-master/build32/glinject'
make[1]: *** [all-recursive] Error 1
make[1]: Leaving directory `/home/stuart/Downloads/ssr-master/build32'
make: *** [all] Error 2
Re: nux build library libXext [message #3062 is a reply to message #3057] Thu, 12 March 2015 13:54 Go to previous message
nux is currently offline  nux
Messages: 1652
Registered: January 2012
Senior Member

No idea what that means. Which software are you trying to build?
Previous Topic: run repoview on repos
Next Topic: can't configure mobile broadband
Goto Forum:

Current Time: Tue Mar 26 23:05:28 GMT 2019

Total time taken to generate the page: 0.01081 seconds